Target
Protein farnesyltransferase subunit beta/geranylgeranyltransferase type-1 subunit alpha
Ligand
BDBM50075851
Substrate
Meas. Tech.
ChEBML_70297
IC50
0.200000±n/a nM
Citation
 Shen, WFakhoury, SDonner, GHenry, KLee, JZhang, HCohen, JWarner, RSaeed, BCherian, STahir, SKovar, PBauch, JNg, SCMarsh, KSham, HRosenberg, S Potent inhibitors of protein farnesyltransferase: heteroarenes as cysteine replacements. Bioorg Med Chem Lett 9:703-8 (1999)  
Target
Name:
Protein farnesyltransferase subunit beta/geranylgeranyltransferase type-1 subunit alpha
Synonyms:
Farnesyltransferase (FTase) Protein Farnesyltransferase (PFT) Chain B | Protein farnesyltransferase
Type:
Protein Complex
Mol. Mass.:
Description:
To express recombinant enzyme in E. coli, the cloned human alpha and beta subunits were co-expressed from a plasmid, in which their expression was translationally coupled.
Components:
This complex has 2 components.
Component 1
Name:
Protein farnesyltransferase subunit beta
Synonyms:
CAAX farnesyltransferase subunit alpha FNTB FTase-alpha GGTase-I-alpha Protein farnesyl/geranylgeranyl transferase Protein farnesyltransferase subunit beta Protein farnesyltransferase/geranylgeranyltransferase type-1 subunit alpha Ras proteins prenyltransferase subunit beta | Type I protein geranyl-geranyltransferase subunit alpha
Type:
Enzyme Subunit
Mol. Mass.:
48766.02
Organism:
Homo sapiens (Human)
Description:
Protein farnesyltransferase subunit beta
Residue:
437
  
Component 2
Name:
Protein farnesyltransferase/geranylgeranyltransferase type-1 subunit alpha
Synonyms:
CAAX farnesyltransferase alpha subunit FNTA_HUMAN FTase-alpha Geranylgeranyl Transferase (GGTase-I) Chain A Protein Farnesyltransferase (PFT) Chain A Protein farnesyltransferase Protein farnesyltransferase/geranylgeranyltransferase type I alpha subunit | Ras proteins prenyltransferase alpha
Type:
Enzyme
Mol. Mass.:
44392.46
Organism:
Homo sapiens (Human)
Description:
Recombinant human FTase.
Residue:
379
  
Inhibitor
Name:
BDBM50075851
Synonyms:
(S)-2-{[5-(2-Imidazol-1-yl-vinyl)-2'-methyl-biphenyl-2-carbonyl]-amino}-4-methylsulfanyl-butyric acid | CHEMBL159400
Type:
Small organic molecule
Emp. Form.:
C24H25N3O3S
Mol. Mass.:
435.539
SMILES:
CSCC[C@H](NC(=O)c1ccc(\C=C\n2ccnc2)cc1-c1ccccc1C)C(O)=O
: