Target
Phosphatidylinositol 4,5-bisphosphate 3-kinase catalytic subunit gamma isoform
Ligand
BDBM50274537
Substrate
Meas. Tech.
ChEMBL_1884048 (CHEMBL4385547)
Ki
4.0±n/a nM
Citation
 Collier, PNPanchagnula, AO'Dowd, HLe Tiran, AAronov, AM Synthesis of a 6-Aza-Isoindolinone-Based Inhibitor of Phosphoinositide 3-Kinase ? via Ruthenium-Catalyzed [2 + 2 + 2] Cyclotrimerization. ACS Med Chem Lett 10:117-120 (2019)  
Target
Name:
Phosphatidylinositol 4,5-bisphosphate 3-kinase catalytic subunit gamma isoform
Synonyms:
PI3-kinase p110 subunit gamma PI3Kgamma PK3CG_HUMAN Phosphatidylinositol 4,5-bisphosphate 3-kinase (PI3K) Phosphatidylinositol 4,5-bisphosphate 3-kinase catalytic subunit gamma (PI3Kgamma) Phosphatidylinositol 4,5-bisphosphate 3-kinase catalytic subunit gamma isoform (PI3K) Phosphatidylinositol-4,5-bisphosphate 3-kinase catalytic subunit gamma isoform Phosphoinositide 3-kinases gamma (PI3K gamma) p120-PI3K
Type:
Enzyme Subunit
Mol. Mass.:
126470.30
Organism:
Homo sapiens (Human)
Description:
P48736
Residue:
1102
  
Inhibitor
Name:
BDBM50274537
Synonyms:
CHEMBL4129974
Type:
Small organic molecule
Emp. Form.:
C19H16F3N5O3
Mol. Mass.:
419.3572
SMILES:
COc1cc(cnc1OC)-c1ccc2C(=O)N(Cc2n1)c1cnn(CC(F)(F)F)c1
: