Target
ORF 73
Ligand
BDBM50521371
Substrate
Meas. Tech.
ChEMBL_1884192 (CHEMBL4385774)
IC50
17000±n/a nM
Citation
 Kirsch, PJakob, VOberhausen, KStein, SCCucarro, ISchulz, TFEmpting, M Fragment-Based Discovery of a Qualified Hit Targeting the Latency-Associated Nuclear Antigen of the Oncogenic Kaposi's Sarcoma-Associated Herpesvirus/Human Herpesvirus 8. J Med Chem 62:3924-3939 (2019)  
Target
Name:
ORF 73
Synonyms:
ORF 73
Type:
PROTEIN
Mol. Mass.:
125975.23
Organism:
Human herpesvirus 8
Description:
ChEMBL_103959
Residue:
1089
  
Inhibitor
Name:
BDBM50521371
Synonyms:
CHEMBL4569451
Type:
Small organic molecule
Emp. Form.:
C14H10N4O2
Mol. Mass.:
266.2548
SMILES:
OC(=O)c1ccc(cc1)-c1cn(nn1)-c1cccnc1
: