Target
ORF 73
Ligand
BDBM50521381
Substrate
Meas. Tech.
ChEMBL_1884196 (CHEMBL4385778)
IC50
39000±n/a nM
Citation
 Kirsch, PJakob, VOberhausen, KStein, SCCucarro, ISchulz, TFEmpting, M Fragment-Based Discovery of a Qualified Hit Targeting the Latency-Associated Nuclear Antigen of the Oncogenic Kaposi's Sarcoma-Associated Herpesvirus/Human Herpesvirus 8. J Med Chem 62:3924-3939 (2019)  
Target
Name:
ORF 73
Synonyms:
ORF 73
Type:
PROTEIN
Mol. Mass.:
125975.23
Organism:
Human herpesvirus 8
Description:
ChEMBL_103959
Residue:
1089
  
Inhibitor
Name:
BDBM50521381
Synonyms:
CHEMBL4436463
Type:
Small organic molecule
Emp. Form.:
C14H15N3O3
Mol. Mass.:
273.2872
SMILES:
OC(=O)c1ccc(cc1)-n1cc(nn1)C1(O)CCCC1
: