Target
ORF 73
Ligand
BDBM50521370
Substrate
Meas. Tech.
ChEMBL_1884195 (CHEMBL4385777)
IC50
25000±n/a nM
Citation
 Kirsch, PJakob, VOberhausen, KStein, SCCucarro, ISchulz, TFEmpting, M Fragment-Based Discovery of a Qualified Hit Targeting the Latency-Associated Nuclear Antigen of the Oncogenic Kaposi's Sarcoma-Associated Herpesvirus/Human Herpesvirus 8. J Med Chem 62:3924-3939 (2019)  
Target
Name:
ORF 73
Synonyms:
ORF 73
Type:
PROTEIN
Mol. Mass.:
125975.23
Organism:
Human herpesvirus 8
Description:
ChEMBL_103959
Residue:
1089
  
Inhibitor
Name:
BDBM50521370
Synonyms:
CHEMBL4468972
Type:
Small organic molecule
Emp. Form.:
C15H12N4O2
Mol. Mass.:
280.2814
SMILES:
Nc1ccccc1-c1cn(nn1)-c1ccc(cc1)C(O)=O
: