Target
Cathepsin D
Ligand
BDBM50076288
Substrate
Meas. Tech.
ChEMBL_45175 (CHEMBL662660)
Ki
71±n/a nM
Citation
 Haque, TSSkillman, AGLee, CEHabashita, HGluzman, IYEwing, TJGoldberg, DEKuntz, IDEllman, JA Potent, low-molecular-weight non-peptide inhibitors of malarial aspartyl protease plasmepsin II. J Med Chem 42:1428-40 (1999)  
Target
Name:
Cathepsin D
Synonyms:
CATD_HUMAN CTSD Cathepsin D heavy chain Cathepsin D precursor
Type:
Enzyme
Mol. Mass.:
44551.72
Organism:
Homo sapiens (Human)
Description:
Human proCathepsin D (SwissProt accession number P07339) was expressed in Sf9 cells, purified, and autoactivated.
Residue:
412
  
Inhibitor
Name:
BDBM50076288
Synonyms:
CHEMBL284955 | Piperidine-4-carboxylic acid [(2S,3S)-3-(4-benzyloxy-3,5-dimethoxy-benzoylamino)-2-hydroxy-4-phenyl-butyl]-[2-(4-methoxy-phenyl)-ethyl]-amide
Type:
Small organic molecule
Emp. Form.:
C41H49N3O7
Mol. Mass.:
695.8437
SMILES:
COc1ccc(CCN(C[C@H](O)[C@H](Cc2ccccc2)NC(=O)c2cc(OC)c(OCc3ccccc3)c(OC)c2)C(=O)C2CCNCC2)cc1
: