Target
Metabotropic glutamate receptor 2
Ligand
BDBM50052256
Substrate
Meas. Tech.
ChEMBL_106208 (CHEMBL713197)
IC50
>300000±n/a nM
Citation
 Jullian, NBrabet, IPin, JPAcher, FC Agonist selectivity of mGluR1 and mGluR2 metabotropic receptors: a different environment but similar recognition of an extended glutamate conformation. J Med Chem 42:1546-55 (1999)  
Target
Name:
Metabotropic glutamate receptor 2
Synonyms:
GPRC1B GRM2_HUMAN Metabotropic glutamate receptor mGlu2 | metabotropic glutamate 2
Type:
Enzyme
Mol. Mass.:
95584.88
Organism:
Homo sapiens (Human)
Description:
Q14416
Residue:
872
  
Inhibitor
Name:
BDBM50052256
Synonyms:
(S)-3-(amino(carboxy)methyl)bicyclo[1.1.1]pentane-1-carboxylic acid 3-(Amino-carboxy-methyl)-bicyclo[1.1.1]pentane-1-carboxylic acid(S-CBPG) CHEMBL43412
Type:
Small organic molecule
Emp. Form.:
C8H11NO4
Mol. Mass.:
185.1772
SMILES:
N[C@H](C(O)=O)C12CC(C1)(C2)C(O)=O
: