Target
Prothrombin
Ligand
BDBM50076508
Substrate
Meas. Tech.
ChEBML_208364
Ki
100±n/a nM
Citation
 Bachand, BDiMaio, JSiddiqui, MA Synthesis and structure-activity relationship of potent bicyclic lactam thrombin inhibitors. Bioorg Med Chem Lett 9:913-8 (1999)  
Target
Name:
Prothrombin
Synonyms:
Activation peptide fragment 1 Coagulation factor II Prothrombin precursor Thrombin heavy chain | Thrombin light chain
Type:
Protein
Mol. Mass.:
70029.57
Organism:
Homo sapiens (Human)
Description:
P00734
Residue:
622
  
Inhibitor
Name:
BDBM50076508
Synonyms:
(3R,6S,8aS)-8a-Methyl-5-oxo-6-(3-phenyl-propyl)-hexahydro-thiazolo[3,2-a]pyridine-3-carboxylic acid [4-guanidino-1-(thiazole-2-carbonyl)-butyl]-amide; HCl | CHEMBL171213
Type:
Small organic molecule
Emp. Form.:
C27H37N6O3S2
Mol. Mass.:
557.751
SMILES:
C[C@]12CC[C@H](CCCc3ccccc3)C(=O)N1[C@@H](CS2)C(=O)NC(CCCNC([NH3+])=N)C(=O)c1nccs1
: