Target
Glucocorticoid receptor
Ligand
BDBM50076687
Substrate
Meas. Tech.
ChEMBL_71259 (CHEMBL685253)
IC50
>10000±n/a nM
Citation
 Edwards, JPHiguchi, RIWinn, DTPooley, CLCaferro, TRHamann, LGZhi, LMarschke, KBGoldman, MEJones, TK Nonsteroidal androgen receptor agonists based on 4-(trifluoromethyl)-2H-pyrano[3,2-g]quinolin-2-one. Bioorg Med Chem Lett 9:1003-8 (1999)  
Target
Name:
Glucocorticoid receptor
Synonyms:
GCR_HUMAN GRL Glucocorticoid receptor (GRFP) Nuclear receptor subfamily 3 group C member 1
Type:
Enzyme
Mol. Mass.:
85656.87
Organism:
Homo sapiens (Human)
Description:
P04150
Residue:
777
  
Inhibitor
Name:
BDBM50076687
Synonyms:
5-Methyl-4-trifluoromethyl-5,6,7,8-tetrahydro-1-oxa-8-aza-anthracen-2-one | CHEMBL415289
Type:
Small organic molecule
Emp. Form.:
C14H12F3NO2
Mol. Mass.:
283.2458
SMILES:
CC1CCNc2cc3oc(=O)cc(c3cc12)C(F)(F)F
: