Target
D(4) dopamine receptor
Ligand
BDBM50077006
Substrate
Meas. Tech.
ChEBML_63105
Ki
4.7±n/a nM
Citation
 Moore, KWBonner, KJones, EAEmms, FLeeson, PDMarwood, RPatel, SPatel, SRowley, MThomas, SCarling, RW 4-N-linked-heterocyclic piperidine derivatives with high affinity and selectivity for human dopamine D4 receptors. Bioorg Med Chem Lett 9:1285-90 (1999)  
Target
Name:
D(4) dopamine receptor
Synonyms:
D(2C) dopamine receptor DOPAMINE D4.2 DRD4 Dopamine D4 receptor
Type:
Enzyme
Mol. Mass.:
48373.19
Organism:
Homo sapiens (Human)
Description:
P21917
Residue:
419
  
Inhibitor
Name:
BDBM50077006
Synonyms:
1-Benzyl-4-(4-methyl-5-phenyl-1H-pyrazol-3-yl)-piperidine | CHEMBL281195
Type:
Small organic molecule
Emp. Form.:
C22H25N3
Mol. Mass.:
331.454
SMILES:
Cc1c([nH]nc1-c1ccccc1)C1CCN(Cc2ccccc2)CC1
: