Target
D(2) dopamine receptor
Ligand
BDBM50077008
Substrate
Meas. Tech.
ChEBML_60057
Ki
1600±n/a nM
Citation
 Moore, KWBonner, KJones, EAEmms, FLeeson, PDMarwood, RPatel, SPatel, SRowley, MThomas, SCarling, RW 4-N-linked-heterocyclic piperidine derivatives with high affinity and selectivity for human dopamine D4 receptors. Bioorg Med Chem Lett 9:1285-90 (1999)  
Target
Name:
D(2) dopamine receptor
Synonyms:
D(2) dopamine receptor DOPAMINE D2 Long DRD2 Dopamine D2 receptor Dopamine D2 receptor (D2R) Dopamine2-like | d2
Type:
Cell-surface receptors
Mol. Mass.:
50647.10
Organism:
Homo sapiens (Human)
Description:
P14416
Residue:
443
  
Inhibitor
Name:
BDBM50077008
Synonyms:
1-Benzyl-4-(5-methyl-4-phenyl-[1,2,3]triazol-1-yl)-piperidine | CHEMBL284346
Type:
Small organic molecule
Emp. Form.:
C21H24N4
Mol. Mass.:
332.4421
SMILES:
Cc1c(nnn1C1CCN(Cc2ccccc2)CC1)-c1ccccc1
: