Target
D(3) dopamine receptor
Ligand
BDBM50076996
Substrate
Meas. Tech.
ChEBML_62111
Ki
450±n/a nM
Citation
 Moore, KWBonner, KJones, EAEmms, FLeeson, PDMarwood, RPatel, SPatel, SRowley, MThomas, SCarling, RW 4-N-linked-heterocyclic piperidine derivatives with high affinity and selectivity for human dopamine D4 receptors. Bioorg Med Chem Lett 9:1285-90 (1999)  
Target
Name:
D(3) dopamine receptor
Synonyms:
DOPAMINE D3 DRD3_HUMAN Dopamine D3 receptor (D3) Dopamine receptor Dopamine receptor D3
Type:
Mol. Mass.:
44243.43
Organism:
Homo sapiens (Human)
Description:
Residue:
400
  
Inhibitor
Name:
BDBM50076996
Synonyms:
1-Benzyl-4-(5-methyl-4-phenyl-pyrazol-1-yl)-piperidine | CHEMBL25772
Type:
Small organic molecule
Emp. Form.:
C22H25N3
Mol. Mass.:
331.454
SMILES:
Cc1c(cnn1C1CCN(Cc2ccccc2)CC1)-c1ccccc1
: