Target
D(2) dopamine receptor
Ligand
BDBM50077003
Substrate
Meas. Tech.
ChEBML_60057
Ki
15±n/a nM
Citation
 Moore, KWBonner, KJones, EAEmms, FLeeson, PDMarwood, RPatel, SPatel, SRowley, MThomas, SCarling, RW 4-N-linked-heterocyclic piperidine derivatives with high affinity and selectivity for human dopamine D4 receptors. Bioorg Med Chem Lett 9:1285-90 (1999)  
Target
Name:
D(2) dopamine receptor
Synonyms:
D(2) dopamine receptor DOPAMINE D2 Long DRD2 Dopamine D2 receptor Dopamine D2 receptor (D2R) Dopamine2-like | d2
Type:
Cell-surface receptors
Mol. Mass.:
50647.10
Organism:
Homo sapiens (Human)
Description:
P14416
Residue:
443
  
Inhibitor
Name:
BDBM50077003
Synonyms:
3-[4-(3-Methyl-4-phenyl-pyrazol-1-yl)-piperidin-1-ylmethyl]-benzonitrile | CHEMBL26120
Type:
Small organic molecule
Emp. Form.:
C23H24N4
Mol. Mass.:
356.4635
SMILES:
Cc1nn(cc1-c1ccccc1)C1CCN(Cc2cccc(c2)C#N)CC1
: