Target
D(2) dopamine receptor
Ligand
BDBM50077005
Substrate
Meas. Tech.
ChEBML_60057
Ki
450±n/a nM
Citation
 Moore, KWBonner, KJones, EAEmms, FLeeson, PDMarwood, RPatel, SPatel, SRowley, MThomas, SCarling, RW 4-N-linked-heterocyclic piperidine derivatives with high affinity and selectivity for human dopamine D4 receptors. Bioorg Med Chem Lett 9:1285-90 (1999)  
Target
Name:
D(2) dopamine receptor
Synonyms:
D(2) dopamine receptor DOPAMINE D2 Long DRD2 Dopamine D2 receptor Dopamine D2 receptor (D2R) Dopamine2-like | d2
Type:
Cell-surface receptors
Mol. Mass.:
50647.10
Organism:
Homo sapiens (Human)
Description:
P14416
Residue:
443
  
Inhibitor
Name:
BDBM50077005
Synonyms:
1-Benzyl-4-(4-phenyl-imidazol-1-yl)-piperidine | CHEMBL287217
Type:
Small organic molecule
Emp. Form.:
C21H23N3
Mol. Mass.:
317.4274
SMILES:
C(N1CCC(CC1)n1cnc(c1)-c1ccccc1)c1ccccc1
: