Target
Protease
Ligand
BDBM50522183
Substrate
Meas. Tech.
ChEMBL_1886095 (CHEMBL4387677)
Ki
5.6±n/a nM
Citation
 Ghosh, AKWilliams, JNKovela, STakayama, JSimpson, HMWalters, DEHattori, SIAoki, MMitsuya, H Potent HIV-1 protease inhibitors incorporating squaramide-derived P2 ligands: Design, synthesis, and biological evaluation. Bioorg Med Chem Lett 29:2565-2570 (2019)  
Target
Name:
Protease
Synonyms:
Type:
Enzyme
Mol. Mass.:
10904.79
Organism:
Human immunodeficiency virus 1 (HIV-1)
Description:
Q9YQ12
Residue:
99
  
Inhibitor
Name:
BDBM50522183
Synonyms:
CHEMBL4467544
Type:
Small organic molecule
Emp. Form.:
C31H39N3O8S
Mol. Mass.:
613.722
SMILES:
[H][C@]12CCO[C@@]1([H])OC[C@H]2Nc1c(N[C@@H](Cc2ccccc2)[C@H](O)CN(CC(C)C)S(=O)(=O)c2ccc(OC)cc2)c(=O)c1=O
: