Target
Somatostatin receptor type 3
Ligand
BDBM50077304
Substrate
Meas. Tech.
ChEMBL_200829 (CHEMBL807042)
Ki
124±n/a nM
Citation
 Hocart, SJJain, RMurphy, WATaylor, JECoy, DH Highly potent cyclic disulfide antagonists of somatostatin. J Med Chem 42:1863-71 (1999)  
Target
Name:
Somatostatin receptor type 3
Synonyms:
SOMATOSTATIN SST3 SS3-R SSR-28 SSTR3 | Somatostatin receptor type 3 (SSTR3)
Type:
Protein
Mol. Mass.:
45855.97
Organism:
Homo sapiens (Human)
Description:
P32745
Residue:
418
  
Inhibitor
Name:
BDBM50077304
Synonyms:
CHEMBL414598 | H-Pfp-cyclo[DCys-His-DTrp-Lys-Val-Cys]-Pfp-NH2
Type:
Small organic molecule
Emp. Form.:
C52H57F10N13O8S2
Mol. Mass.:
1246.205
SMILES:
CC(C)[C@H]1NC(=O)[C@H](CCCCN)NC(=O)[C@@H](Cc2c[nH]c3ccccc23)NC(=O)[C@H](Cc2cnc[nH]2)NC(=O)[C@H](CSSC[C@H](NC1=O)C(=O)N[C@@H](Cc1c(F)c(F)c(F)c(F)c1F)C(N)=O)NC(=O)[C@@H](N)Cc1c(F)c(F)c(F)c(F)c1F
: