Target
Somatostatin receptor type 2
Ligand
BDBM50077269
Substrate
Meas. Tech.
ChEMBL_200687 (CHEMBL807098)
Ki
14±n/a nM
Citation
 Hocart, SJJain, RMurphy, WATaylor, JECoy, DH Highly potent cyclic disulfide antagonists of somatostatin. J Med Chem 42:1863-71 (1999)  
Target
Name:
Somatostatin receptor type 2
Synonyms:
SOMATOSTATIN SST2 SS-2-R SS2R SSTR2 | Somatostatin receptor type 2 (SSTR2)
Type:
Enzyme
Mol. Mass.:
41344.94
Organism:
Homo sapiens (Human)
Description:
P30874
Residue:
369
  
Inhibitor
Name:
BDBM50077269
Synonyms:
CHEMBL385746 | H-Cpa-cyclo[DCys-2Pal-DTrp-Lys-Thr-Cys]-Nal-NH2
Type:
Small organic molecule
Emp. Form.:
C57H67ClN12O9S2
Mol. Mass.:
1163.8
SMILES:
C[C@@H](O)[C@@H]1NC(=O)[C@H](CCCCN)NC(=O)[C@@H](Cc2c[nH]c3ccccc23)NC(=O)[C@@H](Cc2ccccn2)NC(=O)[C@H](CSSC[C@H](NC1=O)C(=O)N[C@@H](Cc1ccc2ccccc2c1)C(N)=O)NC(=O)[C@@H](N)Cc1ccc(Cl)cc1
: