Target
Somatostatin receptor type 5
Ligand
BDBM50077294
Substrate
Meas. Tech.
ChEMBL_200987 (CHEMBL801239)
Ki
66±n/a nM
Citation
 Hocart, SJJain, RMurphy, WATaylor, JECoy, DH Highly potent cyclic disulfide antagonists of somatostatin. J Med Chem 42:1863-71 (1999)  
Target
Name:
Somatostatin receptor type 5
Synonyms:
SOMATOSTATIN SST5 SS5-R SSR5_HUMAN Somatostatin receptor type 5 (SSTR5)
Type:
Enzyme
Mol. Mass.:
39218.02
Organism:
Homo sapiens (Human)
Description:
P35346
Residue:
364
  
Inhibitor
Name:
BDBM50077294
Synonyms:
CHEMBL437448 | H-Bpa-cyclo[DCys-Pal-DTrp-Lys-Val-Cys]-Bpa-NH2
Type:
Small organic molecule
Emp. Form.:
C54H66Br2N12O8S2
Mol. Mass.:
1235.115
SMILES:
CC(C)[C@H]1NC(=O)[C@H](CCCCN)NC(=O)[C@@H](Cc2c[nH]c3ccccc23)NC(=O)[C@H](Cc2cccnc2)NC(=O)[C@H](CSSC[C@@H](NC1=O)C(=O)N[C@@H](Cc1ccc(Br)cc1)C(N)=O)NC(=O)[C@@H](N)Cc1ccc(Br)cc1
: