Target
Somatostatin receptor type 3
Ligand
BDBM50077299
Substrate
Meas. Tech.
ChEMBL_200829 (CHEMBL807042)
Ki
103±n/a nM
Citation
 Hocart, SJJain, RMurphy, WATaylor, JECoy, DH Highly potent cyclic disulfide antagonists of somatostatin. J Med Chem 42:1863-71 (1999)  
Target
Name:
Somatostatin receptor type 3
Synonyms:
SOMATOSTATIN SST3 SS3-R SSR-28 SSTR3 | Somatostatin receptor type 3 (SSTR3)
Type:
Protein
Mol. Mass.:
45855.97
Organism:
Homo sapiens (Human)
Description:
P32745
Residue:
418
  
Inhibitor
Name:
BDBM50077299
Synonyms:
CHEMBL384607 | H-Ypa-cyclo[DCys-Pal-DTrp-Lys-Val-Cys]-Ypa-NH2
Type:
Small organic molecule
Emp. Form.:
C56H66N14O8S2
Mol. Mass.:
1127.342
SMILES:
CC(C)[C@H]1NC(=O)[C@H](CCCCN)NC(=O)[C@@H](Cc2c[nH]c3ccccc23)NC(=O)[C@H](Cc2cccnc2)NC(=O)[C@H](CSSC[C@@H](NC1=O)C(=O)N[C@@H](Cc1ccc(cc1)C#N)C(N)=O)NC(=O)[C@@H](N)Cc1ccc(cc1)C#N
: