Target
Somatostatin receptor type 2
Ligand
BDBM50077266
Substrate
Meas. Tech.
ChEMBL_200687 (CHEMBL807098)
Ki
117±n/a nM
Citation
 Hocart, SJJain, RMurphy, WATaylor, JECoy, DH Highly potent cyclic disulfide antagonists of somatostatin. J Med Chem 42:1863-71 (1999)  
Target
Name:
Somatostatin receptor type 2
Synonyms:
SOMATOSTATIN SST2 SS-2-R SS2R SSTR2 | Somatostatin receptor type 2 (SSTR2)
Type:
Enzyme
Mol. Mass.:
41344.94
Organism:
Homo sapiens (Human)
Description:
P30874
Residue:
369
  
Inhibitor
Name:
BDBM50077266
Synonyms:
CHEMBL406152 | H-3Fpa-cyclo[DCys-Pal-DTrp-Lys-Val-Cys]-3Fpa-NH2
Type:
Small organic molecule
Emp. Form.:
C54H66F2N12O8S2
Mol. Mass.:
1113.304
SMILES:
CC(C)[C@H]1NC(=O)[C@H](CCCCN)NC(=O)[C@@H](Cc2c[nH]c3ccccc23)NC(=O)[C@H](Cc2cccnc2)NC(=O)[C@H](CSSC[C@@H](NC1=O)C(=O)N[C@@H](Cc1cccc(F)c1)C(N)=O)NC(=O)[C@@H](N)Cc1cccc(F)c1
: