Target
Wee1-like protein kinase
Ligand
BDBM50522507
Substrate
Meas. Tech.
ChEMBL_1886839 (CHEMBL4388516)
EC50
29±n/a nM
Citation
 Mastracchio, ALai, CTorrent, MBromberg, KBuchanan, FGFerguson, DBontcheva, VJohnson, EFLasko, LMaag, DShoemaker, ARPenning, TD Investigation of biaryl heterocycles as inhibitors of Wee1 kinase. Bioorg Med Chem Lett 29:1481-1486 (2019)  
Target
Name:
Wee1-like protein kinase
Synonyms:
Serine/threonine-protein kinase WEE1 WEE1 homolog (S. pombe) | WEE1_HUMAN
Type:
PROTEIN
Mol. Mass.:
71599.12
Organism:
Homo sapiens (Human)
Description:
ChEMBL_1445054
Residue:
646
  
Inhibitor
Name:
BDBM50522507
Synonyms:
CHEMBL4470852
Type:
Small organic molecule
Emp. Form.:
C25H21Cl2N5O
Mol. Mass.:
478.373
SMILES:
CN1Cc2cc(Nc3ncc4c(n3)[nH]cc(-c3c(Cl)cccc3Cl)c4=O)ccc2C2(CC2)C1
: