Target
5-hydroxytryptamine receptor 2A
Ligand
BDBM50010047
Substrate
Meas. Tech.
ChEMBL_1888740 (CHEMBL4390417)
Ki
3.0±n/a nM
Citation
 Zar?ba, PJa?kowska, JCzekaj, ISata?a, G Design, synthesis and molecular modelling of new bulky Fananserin derivatives with altered pharmacological profile as potential antidepressants. Bioorg Med Chem 27:3396-3407 (2019)  
Target
Name:
5-hydroxytryptamine receptor 2A
Synonyms:
5-HT-2A 5-HT2A 5-hydroxytryptamine receptor 2A (5HT2A) Htr2 Serotonin Receptor 2A
Type:
G Protein-Coupled Receptor (GPCR)
Mol. Mass.:
52852.05
Organism:
Rattus norvegicus (rat)
Description:
Rat cortex membranes 5-HT2A receptors.
Residue:
471
  
Inhibitor
Name:
BDBM50010047
Synonyms:
2-{3-[4-(2-Fluoro-phenyl)-piperazin-1-yl]-propyl}-2H-naphtho[1,8-cd]isothiazole 1,1-dioxide | CHEMBL83975
Type:
Small organic molecule
Emp. Form.:
C23H24FN3O2S
Mol. Mass.:
425.519
SMILES:
Fc1ccccc1N1CCN(CCCN2c3cccc4cccc(c34)S2(=O)=O)CC1
: