Target
Protein disulfide-isomerase
Ligand
BDBM50523112
Substrate
Meas. Tech.
ChEMBL_1888984 (CHEMBL4390738)
IC50
350±n/a nM
Citation
 Yang, SShergalis, ALu, DKyani, ALiu, ZLjungman, MNeamati, N Design, Synthesis, and Biological Evaluation of Novel Allosteric Protein Disulfide Isomerase Inhibitors. J Med Chem 62:3447-3474 (2019)  
Target
Name:
Protein disulfide-isomerase
Synonyms:
Cellular thyroid hormone-binding protein P4HB PDIA1 PO4DB | Protein Disulfide-Isomerase (PDI)
Type:
Protein
Mol. Mass.:
57084.91
Organism:
Homo sapiens (Human)
Description:
P07237
Residue:
508
  
Inhibitor
Name:
BDBM50523112
Synonyms:
CHEMBL4464788
Type:
Small organic molecule
Emp. Form.:
C20H15NO2
Mol. Mass.:
301.3386
SMILES:
Oc1cccc(c1)C(=O)\C=C\c1ccc(cc1)-c1cccnc1
: