Target
Scytalone dehydratase
Ligand
BDBM50078304
Substrate
Meas. Tech.
ChEBML_199523
Ki
0.032±n/a nM
Citation
 Basarab, GSJordan, DBGehret, TCSchwartz, RSWawrzak, Z Design of scytalone dehydratase inhibitors as rice blast fungicides: derivatives of norephedrine. Bioorg Med Chem Lett 9:1613-8 (1999)  
Target
Name:
Scytalone dehydratase
Synonyms:
SCYD_MAGO7 Scytalone dehydratase
Type:
PROTEIN
Mol. Mass.:
20248.63
Organism:
Magnaporthe grisea
Description:
ChEMBL_199536
Residue:
172
  
Inhibitor
Name:
BDBM50078304
Synonyms:
(6,7-DIFLUORO-QUINAZOLIN-4-YL)-(1-METHYL-2,2-DIPHENYL-ETHYL)-AMINE CHEMBL42632
Type:
Small organic molecule
Emp. Form.:
C23H19F2N3
Mol. Mass.:
375.4139
SMILES:
C[C@H](Nc1ncnc2cc(F)c(F)cc12)C(c1ccccc1)c1ccccc1
: