Target
Uracil-DNA glycosylase
Ligand
BDBM50078340
Substrate
Meas. Tech.
ChEMBL_212798 (CHEMBL878031)
IC50
30000±n/a nM
Citation
 Sun, HZhi, CWright, GEUbiali, DPregnolato, MVerri, AFocher, FSpadari, S Molecular modeling and synthesis of inhibitors of herpes simplex virus type 1 uracil-DNA glycosylase. J Med Chem 42:2344-50 (1999)  
Target
Name:
Uracil-DNA glycosylase
Synonyms:
DGU UNG UNG15 Uracil-DNA glycosylase (UNG)
Type:
Protein
Mol. Mass.:
34661.15
Organism:
Homo sapiens (Human)
Description:
P1305
Residue:
313
  
Inhibitor
Name:
BDBM50078340
Synonyms:
6-(4-Hexyl-phenylamino)-1H-pyrimidine-2,4-dione | CHEMBL77277
Type:
Small organic molecule
Emp. Form.:
C16H21N3O2
Mol. Mass.:
287.3568
SMILES:
CCCCCCc1ccc(Nc2cc(=O)[nH]c(=O)[nH]2)cc1
: