Target
Integrin alpha-IIb/beta-3
Ligand
BDBM50422297
Substrate
Meas. Tech.
ChEMBL_70316 (CHEMBL678021)
Kd
28±n/a nM
Citation
 Egbertson, MSCook, JJBednar, BPrugh, JDBednar, RAGaul, SLGould, RJHartman, GDHomnick, CFHolahan, MALibby, LALynch, JJLynch, RJSitko, GRStranieri, MTVassallo, LM Non-peptide GPIIb/IIIa inhibitors. 20. Centrally constrained thienothiophene alpha-sulfonamides are potent, long acting in vivo inhibitors of platelet aggregation. J Med Chem 42:2409-21 (1999)  
Target
Name:
Integrin alpha-IIb/beta-3
Synonyms:
Glycoprotein IIb/IIIa
Type:
Mol. Mass.:
Description:
ASSAY_ID of EBI is 30109
Components:
This complex has 2 components.
Component 1
Name:
Integrin beta-3
Synonyms:
CD_antigen=CD61 GPIIIa ITGB3 Platelet membrane glycoprotein IIIa
Type:
Protein
Mol. Mass.:
87038.91
Organism:
Homo sapiens (Human)
Description:
P05106
Residue:
788
  
Component 2
Name:
Integrin alpha-IIb
Synonyms:
CD_antigen=CD41 GPIIb Glycoprotein IIb ITGA2B Integrin alpha-IIb heavy chain Integrin alpha-IIb light chain, form 2 Integrin alpha-V/beta-3 and alpha-IIb/beta 3 | Platelet membrane glycoprotein IIb
Type:
Protein
Mol. Mass.:
113354.85
Organism:
Homo sapiens (Human)
Description:
P08514
Residue:
1039
  
Inhibitor
Name:
BDBM50422297
Synonyms:
CHEMBL1229688
Type:
Small organic molecule
Emp. Form.:
C22H26N4O5S3
Mol. Mass.:
522.661
SMILES:
OC(=O)[C@@H](CNC(=O)c1cc2cc(CCC3CCNCC3)sc2s1)NS(=O)(=O)c1cccnc1
: