Target
Diacylglycerol O-acyltransferase 1
Ligand
BDBM50523594
Substrate
Meas. Tech.
ChEMBL_1890736 (CHEMBL4392490)
IC50
1.3±n/a nM
Citation
 Yu, YWu, ZShi, ZCHe, SLai, ZCernak, TAVachal, PLiu, MLiu, JHong, QJian, TGuiadeen, DKrikorian, ASperbeck, DMVerras, ASonatore, LMMurphy, BAWiltsie, JChung, CCGorski, JNLiu, JXiao, JWolff, MTong, SXMadeira, MKaranam, BVShen, DMBalkovec, JMDe Vita, RJPinto, SNargund, RP Accelerating the discovery of DGAT1 inhibitors through the application of parallel medicinal chemistry (PMC). Bioorg Med Chem Lett 29:1380-1385 (2019)  
Target
Name:
Diacylglycerol O-acyltransferase 1
Synonyms:
ACAT-related gene product 1 Acyl coA-diacylglycerol acyl transferase 1 (DGAT1) DGAT1 Diacylglycerol Acyltransferase (DGAT1) Diacylglycerol O-acyltransferase 1 (DGAT1) | Diglyceride acyltransferase
Type:
Protein
Mol. Mass.:
55297.82
Organism:
Homo sapiens (Human)
Description:
O75907
Residue:
488
  
Inhibitor
Name:
BDBM50523594
Synonyms:
CHEMBL4453443
Type:
Small organic molecule
Emp. Form.:
C25H23ClN4O3
Mol. Mass.:
462.928
SMILES:
OC(=O)C[C@H]1CC[C@H](CC1)Oc1ccc(cn1)-c1ccc(cn1)-c1nc2cc(Cl)ccc2[nH]1
: