Target
Protein kinase C eta type
Ligand
BDBM50078563
Substrate
Meas. Tech.
ChEBML_161314
Ki
>500±n/a nM
Citation
 Wender, PALippa, BPark, CMIrie, KNakahara, AOhigashi, H Selective binding of bryostatin analogues to the cysteine rich domains of protein kinase C isozymes. Bioorg Med Chem Lett 9:1687-90 (1999)  
Target
Name:
Protein kinase C eta type
Synonyms:
KPCL_HUMAN PKCL PRKCL Protein kinase C, PKC; classical/novel | nPKC-eta
Type:
Enzyme
Mol. Mass.:
77844.26
Organism:
Homo sapiens (Human)
Description:
The recombinant human PKC enzymes were produced using a baculovirus expression system in SF9 cells
Residue:
683
  
Inhibitor
Name:
BDBM50078563
Synonyms:
11,21-dihydroxy-17-[1-hydroxy-(1R)-ethyl]-10,10-dimethyl-13-[1-methyloxycarbonyl-(E)-methylidene]-19-oxo-(1R,3S,7S,11S,12S,17R,21S,23S)-6,18,27,28,29-pentaoxatetracyclo[21.3.1.13,7.111,15]nonacos-8-en-12-yl octanoate | CHEMBL46053
Type:
Small organic molecule
Emp. Form.:
C39H62O13
Mol. Mass.:
738.9018
SMILES:
CCCCCCCC(=O)O[C@H]1\C(CC2C[C@@H](OC(=O)C[C@@H](O)C[C@@H]3CCC[C@H](C[C@@H]4CCO[C@@H](O4)\C=C\C(C)(C)[C@]1(O)O2)O3)[C@@H](C)O)=C\C(=O)OC
: