Target
Protein kinase C eta type
Ligand
BDBM50078564
Substrate
Meas. Tech.
ChEBML_161314
Ki
70±n/a nM
Citation
 Wender, PALippa, BPark, CMIrie, KNakahara, AOhigashi, H Selective binding of bryostatin analogues to the cysteine rich domains of protein kinase C isozymes. Bioorg Med Chem Lett 9:1687-90 (1999)  
Target
Name:
Protein kinase C eta type
Synonyms:
KPCL_HUMAN PKCL PRKCL Protein kinase C, PKC; classical/novel | nPKC-eta
Type:
Enzyme
Mol. Mass.:
77844.26
Organism:
Homo sapiens (Human)
Description:
The recombinant human PKC enzymes were produced using a baculovirus expression system in SF9 cells
Residue:
683
  
Inhibitor
Name:
BDBM50078564
Synonyms:
CHEMBL45053 | Octanoic acid (E)-(1S,5S,9S,11S,15R,19R,24S)-11-tert-butyl-1,15-dihydroxy-19-((R)-1-hydroxy-ethyl)-23-methoxycarbonylmethylene-2,2-dimethyl-17-oxo-6,12,18,25,26-pentaoxa-tricyclo[19.3.1.1*5,9*]hexacos-3-en-24-yl ester
Type:
Small organic molecule
Emp. Form.:
C40H66O13
Mol. Mass.:
754.9442
SMILES:
CCCCCCCC(=O)O[C@H]1\C(CC2C[C@@H](OC(=O)C[C@H](O)CCO[C@@H](C[C@@H]3CCO[C@@H](O3)\C=C\C(C)(C)[C@]1(O)O2)C(C)(C)C)[C@@H](C)O)=C\C(=O)OC
: