Target
Vasopressin V2 receptor
Ligand
BDBM50078646
Substrate
Meas. Tech.
ChEBML_211235
IC50
0.700000±n/a nM
Citation
 Aranapakam, VAlbright, JDGrosu, GTChan, PSCoupet, JSaunders, TRu, XMazandarani, H 4,10-dihydro-5H-thieno[3,2-c][1]benzazepine derivatives and 9,10-dihydro-4H-thieno[2,3-c][1]benzazepine derivatives as orally active arginine vasopressin receptor antagonists. Bioorg Med Chem Lett 9:1733-6 (1999)  
Target
Name:
Vasopressin V2 receptor
Synonyms:
ADHR AVPR2 DIR Renal-type arginine vasopressin receptor V2R_HUMAN Vasopressin V2 receptor | Vasopressin receptor
Type:
Receptor
Mol. Mass.:
40295.28
Organism:
Homo sapiens (Human)
Description:
P30518
Residue:
371
  
Inhibitor
Name:
BDBM50078646
Synonyms:
CHEMBL49322 | N-[4-(4,10-Dihydro-1-thia-9-aza-benzo[f]azulene-9-carbonyl)-phenyl]-2-methyl-benzamide
Type:
Small organic molecule
Emp. Form.:
C27H22N2O2S
Mol. Mass.:
438.541
SMILES:
Cc1ccccc1C(=O)Nc1ccc(cc1)C(=O)N1Cc2sccc2Cc2ccccc12
: