Target
Vasopressin V1a receptor
Ligand
BDBM50078646
Substrate
Meas. Tech.
ChEBML_211101
IC50
8.5±n/a nM
Citation
 Aranapakam, VAlbright, JDGrosu, GTChan, PSCoupet, JSaunders, TRu, XMazandarani, H 4,10-dihydro-5H-thieno[3,2-c][1]benzazepine derivatives and 9,10-dihydro-4H-thieno[2,3-c][1]benzazepine derivatives as orally active arginine vasopressin receptor antagonists. Bioorg Med Chem Lett 9:1733-6 (1999)  
Target
Name:
Vasopressin V1a receptor
Synonyms:
AVPR V1a AVPR1A V1AR_HUMAN VASOPRESSIN V1A Vasopressin V1 receptor Vasopressin receptor
Type:
Receptor
Mol. Mass.:
46820.18
Organism:
Homo sapiens (Human)
Description:
P37288
Residue:
418
  
Inhibitor
Name:
BDBM50078646
Synonyms:
CHEMBL49322 | N-[4-(4,10-Dihydro-1-thia-9-aza-benzo[f]azulene-9-carbonyl)-phenyl]-2-methyl-benzamide
Type:
Small organic molecule
Emp. Form.:
C27H22N2O2S
Mol. Mass.:
438.541
SMILES:
Cc1ccccc1C(=O)Nc1ccc(cc1)C(=O)N1Cc2sccc2Cc2ccccc12
: