Target
Vasopressin V1a receptor
Ligand
BDBM50078660
Substrate
Meas. Tech.
ChEBML_214559
IC50
7±n/a nM
Citation
 Aranapakam, VAlbright, JDGrosu, GTDelos Santos, EGChan, PSCoupet, JRu, XSaunders, TMazandarani, H 5-fluoro-2-methyl-N-[5-(5H-pyrrolo[2,1-c][1,4]benzodiazepine-10(11H)-yl carbonyl)-2-pyridinyl]benzamide (CL-385004) and analogs as orally active arginine vasopressin receptor antagonists. Bioorg Med Chem Lett 9:1737-40 (1999)  
Target
Name:
Vasopressin V1a receptor
Synonyms:
Avpr1a VASOPRESSIN V1A Vasopressin V1a receptor | Vasopressin receptor
Type:
Enzyme Catalytic Domain
Mol. Mass.:
47674.81
Organism:
RAT
Description:
VASOPRESSIN V1A AVPR1A RAT::P30560
Residue:
424
  
Inhibitor
Name:
BDBM50078660
Synonyms:
CHEMBL299532 | N-[5-(5H,11H-Benzo[e]pyrrolo[1,2-a][1,4]diazepine-10-carbonyl)-pyridin-2-yl]-2-bromo-benzamide
Type:
Small organic molecule
Emp. Form.:
C25H19BrN4O2
Mol. Mass.:
487.348
SMILES:
Brc1ccccc1C(=O)Nc1ccc(cn1)C(=O)N1Cc2cccn2Cc2ccccc12
: