Target
Vasopressin V2 receptor
Ligand
BDBM50078659
Substrate
Meas. Tech.
ChEBML_214259
IC50
8.3±n/a nM
Citation
 Aranapakam, VAlbright, JDGrosu, GTDelos Santos, EGChan, PSCoupet, JRu, XSaunders, TMazandarani, H 5-fluoro-2-methyl-N-[5-(5H-pyrrolo[2,1-c][1,4]benzodiazepine-10(11H)-yl carbonyl)-2-pyridinyl]benzamide (CL-385004) and analogs as orally active arginine vasopressin receptor antagonists. Bioorg Med Chem Lett 9:1737-40 (1999)  
Target
Name:
Vasopressin V2 receptor
Synonyms:
AVPR V2 Avpr2 V2R_RAT Vasopressin receptor
Type:
G-protein coupled receptor
Mol. Mass.:
40761.85
Organism:
Rattus norvegicus (Rat)
Description:
Residue:
371
  
Inhibitor
Name:
BDBM50078659
Synonyms:
Biphenyl-2-carboxylic acid [5-(5H,11H-benzo[e]pyrrolo[1,2-a][1,4]diazepine-10-carbonyl)-pyridin-2-yl]-amide | CHEMBL297705
Type:
Small organic molecule
Emp. Form.:
C31H24N4O2
Mol. Mass.:
484.5479
SMILES:
O=C(Nc1ccc(cn1)C(=O)N1Cc2cccn2Cc2ccccc12)c1ccccc1-c1ccccc1
: