Target
Vasopressin V1a receptor
Ligand
BDBM50078652
Substrate
Meas. Tech.
ChEBML_214559
IC50
6±n/a nM
Citation
 Aranapakam, VAlbright, JDGrosu, GTDelos Santos, EGChan, PSCoupet, JRu, XSaunders, TMazandarani, H 5-fluoro-2-methyl-N-[5-(5H-pyrrolo[2,1-c][1,4]benzodiazepine-10(11H)-yl carbonyl)-2-pyridinyl]benzamide (CL-385004) and analogs as orally active arginine vasopressin receptor antagonists. Bioorg Med Chem Lett 9:1737-40 (1999)  
Target
Name:
Vasopressin V1a receptor
Synonyms:
Avpr1a VASOPRESSIN V1A Vasopressin V1a receptor | Vasopressin receptor
Type:
Enzyme Catalytic Domain
Mol. Mass.:
47674.81
Organism:
RAT
Description:
VASOPRESSIN V1A AVPR1A RAT::P30560
Residue:
424
  
Inhibitor
Name:
BDBM50078652
Synonyms:
CHEMBL301788 | N-[5-(5H,11H-Benzo[e]pyrrolo[1,2-a][1,4]diazepine-10-carbonyl)-pyridin-2-yl]-2-chloro-4-fluoro-benzamide
Type:
Small organic molecule
Emp. Form.:
C25H18ClFN4O2
Mol. Mass.:
460.887
SMILES:
Fc1ccc(C(=O)Nc2ccc(cn2)C(=O)N2Cc3cccn3Cc3ccccc23)c(Cl)c1
: