Target
Metabotropic glutamate receptor 6
Ligand
BDBM50523865
Substrate
Meas. Tech.
ChEMBL_1891258 (CHEMBL4393085)
IC50
>10000±n/a nM
Citation
 Reed, CWWashecheck, JPQuitlag, MCJenkins, MTRodriguez, ALEngers, DWBlobaum, ALConn, PJNiswender, CMLindsley, CW Surveying heterocycles as amide bioisosteres within a series of mGlu Bioorg Med Chem Lett 29:1211-1214 (2019)  
Target
Name:
Metabotropic glutamate receptor 6
Synonyms:
GPRC1F GRM6_HUMAN Metabotropic glutamate receptor 6 metabotropic glutamate 6
Type:
Enzyme Catalytic Domain
Mol. Mass.:
95479.26
Organism:
Homo sapiens (Human)
Description:
metabotropic glutamate 6 GRM6 HUMAN::O15303
Residue:
877
  
Inhibitor
Name:
BDBM50523865
Synonyms:
CHEMBL4476495
Type:
Small organic molecule
Emp. Form.:
C20H15F3N4O4
Mol. Mass.:
432.3527
SMILES:
COc1ccc(cc1OC)-c1nnc(o1)-c1cc(OC(F)(F)F)ccc1-n1ccnc1
: