Target
Beta-2 adrenergic receptor
Ligand
BDBM50078783
Substrate
Meas. Tech.
ChEBML_38319
IC50
1500±n/a nM
Citation
 Mathvink, RJBarritta, AMCandelore, MRCascieri, MADeng, LTota, LStrader, CDWyvratt, MJFisher, MHWeber, AE Potent, elective human beta3 adrenergic receptor agonists containing a substituted indoline-5-sulfonamide pharmacophore. Bioorg Med Chem Lett 9:1869-74 (1999)  
Target
Name:
Beta-2 adrenergic receptor
Synonyms:
ADRB2 ADRB2_HUMAN Beta-2 adrenoceptor | Beta-2 adrenoreceptor
Type:
Mol. Mass.:
46461.69
Organism:
Homo sapiens (Human)
Description:
P07550
Residue:
413
  
Inhibitor
Name:
BDBM50078783
Synonyms:
1-(3-octylphenyl)-N-phenyl-2,3-dihydro-1H-indole-5-sulfonamide | CHEMBL296380
Type:
Small organic molecule
Emp. Form.:
C28H34N2O2S
Mol. Mass.:
462.647
SMILES:
CCCCCCCCc1cccc(c1)N1CCc2cc(ccc12)S(=O)(=O)Nc1ccccc1
: