Target
Beta-3 adrenergic receptor
Ligand
BDBM50078783
Substrate
Meas. Tech.
ChEBML_38920
EC50
1.3±n/a nM
Citation
 Mathvink, RJBarritta, AMCandelore, MRCascieri, MADeng, LTota, LStrader, CDWyvratt, MJFisher, MHWeber, AE Potent, elective human beta3 adrenergic receptor agonists containing a substituted indoline-5-sulfonamide pharmacophore. Bioorg Med Chem Lett 9:1869-74 (1999)  
Target
Name:
Beta-3 adrenergic receptor
Synonyms:
ADRB3 ADRB3_HUMAN Beta-2 adrenergic receptor and beta-3 adrenergic receptor Beta-3 adrenoreceptor | adrenergic Beta3
Type:
G Protein-Coupled Receptor (GPCR)
Mol. Mass.:
43534.88
Organism:
Homo sapiens (Human)
Description:
Residue:
408
  
Inhibitor
Name:
BDBM50078783
Synonyms:
1-(3-octylphenyl)-N-phenyl-2,3-dihydro-1H-indole-5-sulfonamide | CHEMBL296380
Type:
Small organic molecule
Emp. Form.:
C28H34N2O2S
Mol. Mass.:
462.647
SMILES:
CCCCCCCCc1cccc(c1)N1CCc2cc(ccc12)S(=O)(=O)Nc1ccccc1
: