Target
1-phosphatidylinositol 4,5-bisphosphate phosphodiesterase beta-1
Ligand
BDBM66976
Substrate
Meas. Tech.
ChEMBL_156498 (CHEMBL761003)
EC50
50000±n/a nM
Citation
 Pellicciari, RMarinozzi, MCostantino, GNatalini, BMoroni, FPellegrini-Giampietro, D (2R,1'S,2'R,3'S)-2-(2'-Carboxy-3'-phenylcyclopropyl)glycine (PCCG-13), the first potent and selective competitive antagonist of phospholipase D-coupled metabotropic glutamate receptors: asymmetric synthesis and preliminary biological properties. J Med Chem 42:2716-20 (1999)  
Target
Name:
1-phosphatidylinositol 4,5-bisphosphate phosphodiesterase beta-1
Synonyms:
KIAA0581 PLCB1_HUMAN | Phospholipase C-beta-1
Type:
PROTEIN
Mol. Mass.:
138559.20
Organism:
Homo sapiens (Human)
Description:
ChEMBL_156499
Residue:
1216
  
Inhibitor
Name:
BDBM66976
Synonyms:
(1S,3R)-1-aminocyclopentane-1,3-dicarboxylic acid;hydrate CHEMBL34453 SMR001230688 trans-( )-ACPD monohydrate
Type:
Small organic molecule
Emp. Form.:
C7H11NO4
Mol. Mass.:
173.1665
SMILES:
N[C@]1(CC[C@H](C1)C(O)=O)C(O)=O
: