Target
Cyclin-G-associated kinase
Ligand
BDBM4445
Substrate
Meas. Tech.
ChEMBL_1892588 (CHEMBL4394509)
IC50
130±n/a nM
Citation
 Asquith, CRMNaegeli, KMEast, MPLaitinen, THavener, TMWells, CIJohnson, GLDrewry, DHZuercher, WJMorris, DC Design of a Cyclin G Associated Kinase (GAK)/Epidermal Growth Factor Receptor (EGFR) Inhibitor Set to Interrogate the Relationship of EGFR and GAK in Chordoma. J Med Chem 62:4772-4778 (2019)  
Target
Name:
Cyclin-G-associated kinase
Synonyms:
GAK Serine/threonine-protein kinase GAK
Type:
PROTEIN
Mol. Mass.:
143171.28
Organism:
Homo sapiens (Human)
Description:
ChEMBL_1478229
Residue:
1311
  
Inhibitor
Name:
BDBM4445
Synonyms:
4-(3-Bromophenylamino)-6,7-dimethoxyquinoline-3-carbonitrile 6,7-dialkoxyquinoline-3-carbonitrile deriv. 8 | CHEMBL111038
Type:
Small organic molecule
Emp. Form.:
C18H14BrN3O2
Mol. Mass.:
384.227
SMILES:
COc1cc2ncc(C#N)c(Nc3cccc(Br)c3)c2cc1OC
: