Target
Acetolactate synthase, chloroplastic
Ligand
BDBM50079606
Substrate
Meas. Tech.
ChEBML_27494
IC50
97000±n/a nM
Comments
modified from 0.000097 20220121
Citation
 Liu, JLi, ZYan, HWang, LChen, J The design and synthesis of ALS inhibitors from pharmacophore models. Bioorg Med Chem Lett 9:1927-32 (1999)  
Target
Name:
Acetolactate synthase, chloroplastic
Synonyms:
AHAS Acetolactate synthase ILVB_ARATH | TZP5
Type:
PROTEIN
Mol. Mass.:
72585.19
Organism:
Arabidopsis thaliana
Description:
ChEMBL_934103
Residue:
670
  
Inhibitor
Name:
BDBM50079606
Synonyms:
2,5-Dichloro-N-(4-methyl-pyrimidin-2-yl)-benzenesulfonamide | CHEMBL59112
Type:
Small organic molecule
Emp. Form.:
C11H9Cl2N3O2S
Mol. Mass.:
318.179
SMILES:
Cc1ccnc(NS(=O)(=O)c2cc(Cl)ccc2Cl)n1
: