Target
Carbonic anhydrase 12
Ligand
BDBM50524773
Substrate
Meas. Tech.
ChEMBL_1894753 (CHEMBL4396674)
IC50
170±n/a nM
Citation
 Zaraei, SOEl-Gamal, MIShafique, ZAmjad, STAfridi, SZaib, SAnbar, HSEl-Gamal, RIqbal, J Sulfonate and sulfamate derivatives possessing benzofuran or benzothiophene nucleus as potent carbonic anhydrase II/IX/XII inhibitors. Bioorg Med Chem 27:3889-3901 (2019)  
Target
Name:
Carbonic anhydrase 12
Synonyms:
CA-XII CAH12_HUMAN Carbonic anhydrase Carbonic anhydrase XII Carbonic anhydrase XII (CAXII) | Tumor antigen HOM-RCC-3.1.3
Type:
Enzyme
Mol. Mass.:
39456.00
Organism:
Homo sapiens (Human)
Description:
Catalytic domain of human cloned isozyme was used in the assay
Residue:
354
  
Inhibitor
Name:
BDBM50524773
Synonyms:
CHEMBL4533978
Type:
Small organic molecule
Emp. Form.:
C16H15NO4S
Mol. Mass.:
317.36
SMILES:
CN(C)S(=O)(=O)Oc1ccc(cc1)-c1ccc2occc2c1
: