Target
Beta-lactamase
Ligand
BDBM50079694
Substrate
Meas. Tech.
ChEMBL_41050 (CHEMBL650472)
IC50
1±n/a nM
Citation
 Buynak, JDRao, ASDoppalapudi, VRAdam, GPetersen, PJNidamarthy, SD The synthesis and evaluation of 6-alkylidene-2'beta-substituted penam sulfones as beta-lactamase inhibitors. Bioorg Med Chem Lett 9:1997-2002 (1999)  
Target
Name:
Beta-lactamase
Synonyms:
BLAC_STAAU Penicillinase | blaZ
Type:
PROTEIN
Mol. Mass.:
31367.53
Organism:
Staphylococcus aureus
Description:
ChEMBL_41052
Residue:
281
  
Inhibitor
Name:
BDBM50079694
Synonyms:
CHEMBL294608 | Sodium; (2S,3R)-3-methyl-4,4,7-trioxo-3-phenylacetoxymethyl-6-[1-pyridin-2-yl-meth-(Z)-ylidene]-4lambda*6*-thia-1-aza-bicyclo[3.2.0]heptane-2-carboxylate
Type:
Small organic molecule
Emp. Form.:
C22H19N2O7S
Mol. Mass.:
455.461
SMILES:
C[C@]1(COC(=O)Cc2ccccc2)[C@@H](N2C(\C(=C/c3ccccn3)C2=O)S1(=O)=O)C([O-])=O
: