Target
5-hydroxytryptamine receptor 2C
Ligand
BDBM50250803
Substrate
Meas. Tech.
ChEMBL_1895347 (CHEMBL4397382)
Ki
159±n/a nM
Citation
 Reilly, SWRiad, AAHsieh, CJSahlholm, KJacome, DAGriffin, STaylor, MWeng, CCXu, KKirschner, NLuedtke, RRParry, CMalhotra, SKaranicolas, JMach, RH Leveraging a Low-Affinity Diazaspiro Orthosteric Fragment to Reduce Dopamine D J Med Chem 62:5132-5147 (2019)  
Target
Name:
5-hydroxytryptamine receptor 2C
Synonyms:
5-HT-1C 5-HT1C 5-HT2C-INI 5-HTR2C 5-hydroxytryptamine receptor 2C (5-HT-2C) 5HT-1C HTR1C Serotonin (5-HT3) receptor Serotonin Receptor 2C
Type:
G Protein-Coupled Receptor (GPCR)
Mol. Mass.:
51836.79
Organism:
Homo sapiens (Human)
Description:
P28335
Residue:
458
  
Inhibitor
Name:
BDBM50250803
Synonyms:
CHEMBL4083252
Type:
Small organic molecule
Emp. Form.:
C23H29N5OS
Mol. Mass.:
423.574
SMILES:
COc1ccccc1N1CCN(CCCSc2nnc(-c3ccccc3)n2C)CC1
: