Target
D(3) dopamine receptor
Ligand
BDBM50525044
Substrate
Meas. Tech.
ChEMBL_1895321 (CHEMBL4397356)
Ki
62±n/a nM
Citation
 Reilly, SWRiad, AAHsieh, CJSahlholm, KJacome, DAGriffin, STaylor, MWeng, CCXu, KKirschner, NLuedtke, RRParry, CMalhotra, SKaranicolas, JMach, RH Leveraging a Low-Affinity Diazaspiro Orthosteric Fragment to Reduce Dopamine D J Med Chem 62:5132-5147 (2019)  
Target
Name:
D(3) dopamine receptor
Synonyms:
DOPAMINE D3 DRD3_HUMAN Dopamine D3 receptor (D3) Dopamine receptor Dopamine receptor D3
Type:
Mol. Mass.:
44243.43
Organism:
Homo sapiens (Human)
Description:
Residue:
400
  
Inhibitor
Name:
BDBM50525044
Synonyms:
CHEMBL4528652
Type:
Small organic molecule
Emp. Form.:
C29H42N4O2
Mol. Mass.:
478.6694
SMILES:
COc1ccccc1N1CCC2(CCN(CCCCNC(=O)c3ccc(cc3)N(C)C)CC2)CC1
: