Target
D(3) dopamine receptor
Ligand
BDBM50250803
Substrate
Meas. Tech.
ChEMBL_1895335 (CHEMBL4397370)
Ki
6.0±n/a nM
Citation
 Reilly, SWRiad, AAHsieh, CJSahlholm, KJacome, DAGriffin, STaylor, MWeng, CCXu, KKirschner, NLuedtke, RRParry, CMalhotra, SKaranicolas, JMach, RH Leveraging a Low-Affinity Diazaspiro Orthosteric Fragment to Reduce Dopamine D J Med Chem 62:5132-5147 (2019)  
Target
Name:
D(3) dopamine receptor
Synonyms:
DOPAMINE D3 DRD3_HUMAN Dopamine D3 receptor (D3) Dopamine receptor Dopamine receptor D3
Type:
Mol. Mass.:
44243.43
Organism:
Homo sapiens (Human)
Description:
Residue:
400
  
Inhibitor
Name:
BDBM50250803
Synonyms:
CHEMBL4083252
Type:
Small organic molecule
Emp. Form.:
C23H29N5OS
Mol. Mass.:
423.574
SMILES:
COc1ccccc1N1CCN(CCCSc2nnc(-c3ccccc3)n2C)CC1
: