Target
5-hydroxytryptamine receptor 7
Ligand
BDBM50250803
Substrate
Meas. Tech.
ChEMBL_1895352 (CHEMBL4397387)
Ki
128±n/a nM
Citation
 Reilly, SWRiad, AAHsieh, CJSahlholm, KJacome, DAGriffin, STaylor, MWeng, CCXu, KKirschner, NLuedtke, RRParry, CMalhotra, SKaranicolas, JMach, RH Leveraging a Low-Affinity Diazaspiro Orthosteric Fragment to Reduce Dopamine D J Med Chem 62:5132-5147 (2019)  
Target
Name:
5-hydroxytryptamine receptor 7
Synonyms:
5-HT-7 5-HT7 5-HT7S 5HT7 HTR7 | Serotonin receptor 7
Type:
G Protein-Coupled Receptor (GPCR)
Mol. Mass.:
53573.08
Organism:
Homo sapiens (Human)
Description:
P34969
Residue:
479
  
Inhibitor
Name:
BDBM50250803
Synonyms:
CHEMBL4083252
Type:
Small organic molecule
Emp. Form.:
C23H29N5OS
Mol. Mass.:
423.574
SMILES:
COc1ccccc1N1CCN(CCCSc2nnc(-c3ccccc3)n2C)CC1
: