Target
Beta-2 adrenergic receptor
Ligand
BDBM50407517
Substrate
Meas. Tech.
ChEMBL_1895537 (CHEMBL4397572)
EC50
20±n/a nM
Citation
 Stanek, MPicard, LPSchmidt, MFKaindl, JMHübner, HBouvier, MWeikert, DGmeiner, P Hybridization of ?-Adrenergic Agonists and Antagonists Confers G Protein Bias. J Med Chem 62:5111-5131 (2019)  
Target
Name:
Beta-2 adrenergic receptor
Synonyms:
ADRB2 ADRB2_HUMAN Beta-2 adrenoceptor | Beta-2 adrenoreceptor
Type:
Mol. Mass.:
46461.69
Organism:
Homo sapiens (Human)
Description:
P07550
Residue:
413
  
Inhibitor
Name:
BDBM50407517
Synonyms:
(-)ISOPROTERENOL US9492405, 27
Type:
Small organic molecule
Emp. Form.:
C11H17NO3
Mol. Mass.:
211.2576
SMILES:
CC(C)NC[C@H](O)c1ccc(O)c(O)c1
: