Target
Protein arginine N-methyltransferase 8
Ligand
BDBM50525201
Substrate
Meas. Tech.
ChEMBL_1896035 (CHEMBL4398070)
IC50
3700±n/a nM
Citation
 Guo, ZZhang, ZYang, HCao, DXu, XZheng, XChen, DWang, QLi, YLi, JDu, ZWang, XChen, LDing, JShen, JGeng, MHuang, XXiong, B Design and Synthesis of Potent, Selective Inhibitors of Protein Arginine Methyltransferase 4 against Acute Myeloid Leukemia. J Med Chem 62:5414-5433 (2019)  
Target
Name:
Protein arginine N-methyltransferase 8
Synonyms:
ANM8_HUMAN HRMT1L3 Heterogeneous nuclear ribonucleoprotein methyltransferase-like protein 4 Protein arginine N-methyltransferase 8 Protein arginine methyltransferase 8 (PRMT8)
Type:
Protein
Mol. Mass.:
45293.70
Organism:
Homo sapiens (Human)
Description:
Residue:
394
  
Inhibitor
Name:
BDBM50525201
Synonyms:
CHEMBL4463124
Type:
Small organic molecule
Emp. Form.:
C23H27N3O2S
Mol. Mass.:
409.544
SMILES:
CNC[C@@H](O)CN1CCc2c(C1)cccc2OCc1ccc(cc1)-c1nccs1
: