Target
Bcl-2-like protein 1
Ligand
BDBM50162797
Substrate
Meas. Tech.
ChEMBL_1896422 (CHEMBL4398457)
Ki
<0.010000±n/a nM
Citation
 Yang, SMao, YZhang, HXu, YAn, JHuang, Z The chemical biology of apoptosis: Revisited after 17 years. Eur J Med Chem 177:63-75 (2019)  
Target
Name:
Bcl-2-like protein 1
Synonyms:
Anti-apoptotic Bcl-2 protein Apoptosis regulator Bcl-X BCL2-like 1 isoform 1 BCL2L1 Bcl-2-like protein 1 (Bcl-XL) Bcl-xL/Bcl-2-binding component 3 Bcl2-antagonist of cell death (BAD)
Type:
Mitochondrion membrane; Single-pass membrane protein
Mol. Mass.:
26039.60
Organism:
Homo sapiens (Human)
Description:
Residue:
233
  
Inhibitor
Name:
BDBM50162797
Synonyms:
CHEMBL3793424
Type:
Small organic molecule
Emp. Form.:
C38H38N6O3S
Mol. Mass.:
658.812
SMILES:
Cc1c(cnn1CC12CC3CC(CC(C3)C1)C2)-c1ccc(nc1C(O)=O)N1CCc2cccc(C(=O)Nc3nc4ccccc4s3)c2C1
: