Target
Arachidonate 5-lipoxygenase-activating protein
Ligand
BDBM50029559
Substrate
Meas. Tech.
ChEMBL_4309 (CHEMBL618417)
IC50
2±n/a nM
Citation
 Frenette, RHutchinson, JHLéger, SThérien, MBrideau, CChan, CCCharleson, SEthier, DGuay, JJones, TRMcAuliffe, MPiechuta, HRiendeau, DTagari, PGirard, Y Substituted indoles as potent and orally active 5-lipoxygenase activating protein (FLAP) inhibitors. Bioorg Med Chem Lett 9:2391-6 (1999)  
Target
Name:
Arachidonate 5-lipoxygenase-activating protein
Synonyms:
5-lipoxygenase activating protein 5-lipoxygenase/FLAP ALOX5AP MK-886-binding protein
Type:
Enzyme
Mol. Mass.:
18159.90
Organism:
Homo sapiens (Human)
Description:
P20292
Residue:
161
  
Inhibitor
Name:
BDBM50029559
Synonyms:
2-[3-tert-Butylsulfanyl-1-(4-chloro-benzyl)-5-(quinolin-2-ylmethoxy)-1H-indol-2-yl]-2-methyl-propionic acid 3-(3-(tert-butylthio)-1-(4-chlorobenzyl)-5-(quinolin-2-ylmethoxy)-1H-indol-2-yl)-2,2-dimethylpropanoic acid 3-[3-tert-Butylsulfanyl-1-(4-chloro-benzyl)-5-(quinolin-2-ylmethoxy)-1H-indol-2-yl]-2,2-dimethyl-propionic acid L-686708 | MK-591
Type:
Small organic molecule
Emp. Form.:
C34H35ClN2O3S
Mol. Mass.:
587.171
SMILES:
CC(C)(C)Sc1c(CC(C)(C)C(O)=O)n(Cc2ccc(Cl)cc2)c2ccc(OCc3ccc4ccccc4n3)cc12
: